Target
Potassium voltage-gated channel subfamily H member 2
Ligand
BDBM315864
Substrate
Meas. Tech.
Kv11.1 (hERG) ION CHANNEL ACTIVITY (Patch Clamp Assay)
Ki
<10000±n/a nM
Citation
 Fuchss, TEmde, UBuchstaller, HMederski, W Arylquinazolines US Patent  US10172859 Publication Date 1/8/2019 
Target
Name:
Potassium voltage-gated channel subfamily H member 2
Synonyms:
1,3-beta-glucan synthase component GLS2 ERG Eag-related protein 1 Ether-a-go-go-related gene (HERG) Ether-a-go-go-related gene potassium channel 1 Ether-a-go-go-related gene potassium channel 1 (hERG1) Ether-a-go-go-related protein 1 H-ERG KCNH2 Potassium voltage-gated channel subfamily H member 2 (hERG) Voltage-gated potassium channel subunit Kv11.1 hERG Potassium Channel 1 | putative potassium channel subunit
Type:
Multi-pass membrane protein
Mol. Mass.:
126672.65
Organism:
Homo sapiens (Human)
Description:
Q12809
Residue:
1159
  
Inhibitor
Name:
BDBM315864
Synonyms:
2-(7-Chlorothieno- [2,3-d}pyridazin-4-yl)- 2-[4-fluoro-3-(7- morpholin-4-yl- quinazolin-4-yl)- phenyl]acetamide1H NMR (500 MHz, DMSO-d6) ppm = 9.09 (s,1H), 8.43 (d, J = 5.4, 1H), 7.86 (d, J = 5.4, 1H), 7.77(s, 1H), 7.74-7.67 (m, 2H), 7.56 (dd, J = 9.4, 3.1,1H), 7.50 (dd, J = 9.5, 2.5, 1H), 7.44-7.35 (m, 2H),7.19 (d, J = 2.4, 1H), 5.92 (s, 1H), 3.81-3.74 (m,4H), 3.47-3.40 (m, 4H). US11065253, Example 291 | US9732094, Example 291
Type:
Small organic molecule
Emp. Form.:
C26H20ClFN6O2S
Mol. Mass.:
534.992
SMILES:
NC(=O)C(c1ccc(F)c(c1)-c1ncnc2cc(ccc12)N1CCOCC1)c1nnc(Cl)c2sccc12
: