Target
DNA-dependent protein kinase catalytic subunit
Ligand
BDBM315932
Substrate
Meas. Tech.
DNA-PK Assay (Biochemical)
IC50
<3±n/a nM
Citation
 Fuchss, TEmde, UBuchstaller, HMederski, W Arylquinazolines US Patent  US10172859 Publication Date 1/8/2019 
Target
Name:
DNA-dependent protein kinase catalytic subunit
Synonyms:
DNA-PK catalytic subunit DNA-dependent protein kinase (DNA-PK) DNA-dependent protein kinase catalytic subunit (DNA-PK) HYRC PRKDC | PRKDC_HUMAN
Type:
Protein
Mol. Mass.:
469114.78
Organism:
Homo sapiens (Human)
Description:
P78527
Residue:
4128
  
Inhibitor
Name:
BDBM315932
Synonyms:
US10172859, Example 356 US9732094, Example 356 | [4-Fluoro-3-(7- morpholin-4-yl- quinazolin-4-yl)- phenyl]pyrrolo[1,2-a]- pyrazin-1-ylmethanol1H NMR (500 MHz, DMSO-d6) ppm = 9.10 (s,1H), 8.20 (dd, J = 4.8, 1.0, 1H), 7.79-7.72 (m, 3H),7.53-7.45 (m, 3H), 7.40-7.34 (m, 1H), 7.20 (d,J = 2.1, 1H), 7.02 (dt, J = 4.1, 1.2, 1H), 6.87 (dd,J = 4.1, 2.5, 1H), 6.33 (d, J = 4.9, 1H), 6.06 (d,J = 4.8, 1H), 3.82-3.76 (m, 4H), 3.48-3.42 (m,4H).
Type:
Small organic molecule
Emp. Form.:
C26H22FN5O2
Mol. Mass.:
455.4836
SMILES:
OC(c1ccc(F)c(c1)-c1ncnc2cc(ccc12)N1CCOCC1)c1nccn2cccc12
: