Target
Isocitrate dehydrogenase [NADP], mitochondrial [R140Q]
Ligand
BDBM280016
Substrate
Meas. Tech.
In Vitro Assays for IDH2m R140Q Inhibitors
IC50
<50±n/a nM
Citation
 Konteatis, ZDPopovici-Muller, JTravins, JMZahler, RCai, ZZhou, D Therapeutically active compounds and their methods of use US Patent  US10172864 Publication Date 1/8/2019 
Target
Name:
Isocitrate dehydrogenase [NADP], mitochondrial [R140Q]
Synonyms:
IDH2 IDHP_HUMAN | idh2 r140q
Type:
Enzyme Catalytic Domain
Mol. Mass.:
50823.17
Organism:
Homo sapiens (Human)
Description:
P48735 (R140Q)
Residue:
452
  
Inhibitor
Name:
BDBM280016
Synonyms:
US10028961, Compound 169 | US10172864, Compound 169
Type:
Small organic molecule
Emp. Form.:
C20H16F5N9
Mol. Mass.:
477.3934
SMILES:
FC(F)(F)c1ccn(n1)-c1nc(NC2CC(F)(F)C2)nc(Nc2ccnc(c2)C2(CC2)[N+]#[C-])n1
: