Target
Isocitrate dehydrogenase [NADP] cytoplasmic [R132H]
Ligand
BDBM280052
Substrate
Meas. Tech.
In Vitro Assays for IDH1m (R132H or R132C) Inhibitors
IC50
<50±n/a nM
Citation
 Konteatis, ZDPopovici-Muller, JTravins, JMZahler, RCai, ZZhou, D Therapeutically active compounds and their methods of use US Patent  US10172864 Publication Date 1/8/2019 
Target
Name:
Isocitrate dehydrogenase [NADP] cytoplasmic [R132H]
Synonyms:
Cytosolic NADP-isocitrate dehydrogenase (IDH1)(R132H) IDH1 R132H IDHC_HUMAN Isocitrate dehydrogenase 1 mutant (R132H) Isocitrate dehydrogenase [NADP] cytoplasmic (IDH1)(R132H) PICD
Type:
Protein
Mol. Mass.:
46641.74
Organism:
Homo sapiens (Human)
Description:
Human IDH1 R132H (SEQ ID No. 2 in patent). First three are removed. Google patent parsed wrong.
Residue:
414
  
Inhibitor
Name:
BDBM280052
Synonyms:
US10028961, Compound 205 US10946023, Compound 205
Type:
Small organic molecule
Emp. Form.:
C19H22F6N6S
Mol. Mass.:
480.474
SMILES:
FC(F)c1csc(n1)-c1nc(NC2CCC(F)(F)CC2)nc(NC2CCC(F)(F)CC2)n1
: