Target
Rho-associated protein kinase 2
Ligand
BDBM316079
Substrate
IC50
500±30 nM
Citation
 Lawrence, NJSebti, SMPireddu, R Rho kinase inhibitors and methods of use US Patent  US9616064 Publication Date 4/11/2017 
Target
Name:
Rho-associated protein kinase 2
Synonyms:
KIAA0619 ROCK2 Rho kinase 2 (ROCKII) Rho-associated protein kinase 2 (ROCK2) Rho-associated protein kinase 2/Transforming protein RhoA Rho-associated, coiled-coil-containing protein kinase II p164 ROCK-2
Type:
Protein
Mol. Mass.:
160885.43
Organism:
Homo sapiens (Human)
Description:
O75116
Residue:
1388
  
Inhibitor
Name:
BDBM316079
Synonyms:
US9616064, Compound 13m
Type:
Small organic molecule
Emp. Form.:
C13H13ClN4
Mol. Mass.:
260.722
SMILES:
CC1Cc2cc(Cl)ccc2N1c1ccnc(N)n1
: