Target
Rho-associated protein kinase 1
Ligand
BDBM316093
Substrate
Meas. Tech.
Z-lyte FRET Assay
IC50
20800±6300 nM
Citation
 Lawrence, NJSebti, SMPireddu, R Rho kinase inhibitors and methods of use US Patent  US9616064 Publication Date 4/11/2017 
Target
Name:
Rho-associated protein kinase 1
Synonyms:
ROCK-I ROCK1_HUMAN Rho-associated protein kinase Rho-associated, coiled-coil-containing protein kinase 1 Rho-kinase (ROCK I) p160 ROCK-1 | p160ROCK
Type:
Serine/threonine-protein kinase
Mol. Mass.:
158156.77
Organism:
Homo sapiens (Human)
Description:
Q13464
Residue:
1354
  
Inhibitor
Name:
BDBM316093
Synonyms:
US9616064, Compound 27a
Type:
Small organic molecule
Emp. Form.:
C20H17N5O
Mol. Mass.:
343.3819
SMILES:
Nc1nccc(n1)-n1ccc2cc(NC(=O)Cc3ccccc3)ccc12
: