Target
Rho-associated protein kinase 1
Ligand
BDBM316099
Substrate
Meas. Tech.
Z-lyte FRET Assay
IC50
53600±4100 nM
Citation
 Lawrence, NJSebti, SMPireddu, R Rho kinase inhibitors and methods of use US Patent  US9616064 Publication Date 4/11/2017 
Target
Name:
Rho-associated protein kinase 1
Synonyms:
ROCK-I ROCK1_HUMAN Rho-associated protein kinase Rho-associated, coiled-coil-containing protein kinase 1 Rho-kinase (ROCK I) p160 ROCK-1 | p160ROCK
Type:
Serine/threonine-protein kinase
Mol. Mass.:
158156.77
Organism:
Homo sapiens (Human)
Description:
Q13464
Residue:
1354
  
Inhibitor
Name:
BDBM316099
Synonyms:
US9616064, Compound 21c
Type:
Small organic molecule
Emp. Form.:
C20H18N4O
Mol. Mass.:
330.3831
SMILES:
Nc1nccc(n1)-n1ccc2c(OCCc3ccccc3)cccc12
: