Target
Rho-associated protein kinase 2
Ligand
BDBM316101
Substrate
IC50
32700±8100 nM
Citation
 Lawrence, NJSebti, SMPireddu, R Rho kinase inhibitors and methods of use US Patent  US9616064 Publication Date 4/11/2017 
Target
Name:
Rho-associated protein kinase 2
Synonyms:
KIAA0619 ROCK2 Rho kinase 2 (ROCKII) Rho-associated protein kinase 2 (ROCK2) Rho-associated protein kinase 2/Transforming protein RhoA Rho-associated, coiled-coil-containing protein kinase II p164 ROCK-2
Type:
Protein
Mol. Mass.:
160885.43
Organism:
Homo sapiens (Human)
Description:
O75116
Residue:
1388
  
Inhibitor
Name:
BDBM316101
Synonyms:
US9616064, Compound 21g
Type:
Small organic molecule
Emp. Form.:
C19H15ClN4O
Mol. Mass.:
350.802
SMILES:
Nc1nccc(n1)-n1ccc2c(OCc3cccc(Cl)c3)cccc12
: