Target
Cyclin-dependent kinase 9
Ligand
BDBM316200
Substrate
Meas. Tech.
Fluorescent Polarization Assay
IC50
<1000±n/a nM
Citation
 Lori, FChafouleas, JDe Forni, DSolinas, AVarga, ZGreff, ZÖrfi, LKéri, G 4,6-disubstituted aminopyrimidine derivatives have anti-HIV activity US Patent  US9617225 Publication Date 4/11/2017 
Target
Name:
Cyclin-dependent kinase 9
Synonyms:
C-2K CDK9 Cell division cycle 2-like protein kinase 4 Cyclin-Dependent Kinase 9 (CDK9) Serine/threonine-protein kinase PITALRE Tat-associated kinase complex catalytic subunit
Type:
Enzyme Subunit
Mol. Mass.:
42789.13
Organism:
Homo sapiens (Human)
Description:
Residue:
372
  
Inhibitor
Name:
BDBM316200
Synonyms:
2-methoxy-5-(6-(2-methoxyphenyl)pyrimidin-4-ylamino)-N-(pyridin-4-ylmethyl)benzamide US9617225, Example 28
Type:
Small organic molecule
Emp. Form.:
C25H23N5O3
Mol. Mass.:
441.4818
SMILES:
COc1ccc(Nc2cc(ncn2)-c2ccccc2OC)cc1C(=O)NCc1ccncc1
: