Target
Cyclin-dependent kinase 9
Ligand
BDBM316267
Substrate
Meas. Tech.
Fluorescent Polarization Assay
IC50
<1000±n/a nM
Citation
 Lori, FChafouleas, JDe Forni, DSolinas, AVarga, ZGreff, ZÖrfi, LKéri, G 4,6-disubstituted aminopyrimidine derivatives have anti-HIV activity US Patent  US9617225 Publication Date 4/11/2017 
Target
Name:
Cyclin-dependent kinase 9
Synonyms:
C-2K CDK9 Cell division cycle 2-like protein kinase 4 Cyclin-Dependent Kinase 9 (CDK9) Serine/threonine-protein kinase PITALRE Tat-associated kinase complex catalytic subunit
Type:
Enzyme Subunit
Mol. Mass.:
42789.13
Organism:
Homo sapiens (Human)
Description:
Residue:
372
  
Inhibitor
Name:
BDBM316267
Synonyms:
Carbonic acid 2-methoxy-5-[6-(2-methoxy-phenyl)-pyrimidin-4-ylamino]-phenyl ester methyl ester US9617225, Example 95
Type:
Small organic molecule
Emp. Form.:
C20H19N3O5
Mol. Mass.:
381.382
SMILES:
COC(=O)Oc1cc(Nc2cc(ncn2)-c2ccccc2OC)ccc1OC
: