Target
Cyclin-dependent kinase 9
Ligand
BDBM316303
Substrate
Meas. Tech.
Fluorescent Polarization Assay
IC50
<1000±n/a nM
Citation
 Lori, FChafouleas, JDe Forni, DSolinas, AVarga, ZGreff, ZÖrfi, LKéri, G 4,6-disubstituted aminopyrimidine derivatives have anti-HIV activity US Patent  US9617225 Publication Date 4/11/2017 
Target
Name:
Cyclin-dependent kinase 9
Synonyms:
C-2K CDK9 Cell division cycle 2-like protein kinase 4 Cyclin-Dependent Kinase 9 (CDK9) Serine/threonine-protein kinase PITALRE Tat-associated kinase complex catalytic subunit
Type:
Enzyme Subunit
Mol. Mass.:
42789.13
Organism:
Homo sapiens (Human)
Description:
Residue:
372
  
Inhibitor
Name:
BDBM316303
Synonyms:
5-[6-(2-Ethoxy-5-fluoro-phenyl)- pyrimidin-4-ylamino]-2-methoxy- benzamide US9617225, Example 131
Type:
Small organic molecule
Emp. Form.:
C20H19FN4O3
Mol. Mass.:
382.3883
SMILES:
CCOc1ccc(F)cc1-c1cc(Nc2ccc(OC)c(c2)C(N)=O)ncn1
: