Target
Vasopressin V1a receptor
Ligand
BDBM316328
Substrate
Meas. Tech.
Binding Assay
Ki
55±n/a nM
Citation
 Braje, WFroggett, JGeneste, HHornberger, WJantos, KKling, Avan Gaalen, M Fused heterocyclic or carbocyclic compounds carrying a substituted cycloaliphatic radical and use thereof for treating vasopressin-related diseases US Patent  US9617226 Publication Date 4/11/2017 
Target
Name:
Vasopressin V1a receptor
Synonyms:
AVPR V1a AVPR1A V1AR_HUMAN VASOPRESSIN V1A Vasopressin V1 receptor Vasopressin receptor
Type:
Receptor
Mol. Mass.:
46820.18
Organism:
Homo sapiens (Human)
Description:
P37288
Residue:
418
  
Inhibitor
Name:
BDBM316328
Synonyms:
US9617226, Example 11 cis-2-[2-(3-Chlorophenyl)-4-oxo-6-[3-(pyrrolidin-1-ylmethyl)cyclobutyl]quinazolin-3-yl]-N-isopropyl-acetamide
Type:
Small organic molecule
Emp. Form.:
C28H33ClN4O2
Mol. Mass.:
493.04
SMILES:
CC(C)NC(=O)Cn1c(nc2ccc(cc2c1=O)[C@@H]1C[C@H](CN2CCCC2)C1)-c1cccc(Cl)c1
: