Target
Beta-glucuronidase
Ligand
BDBM316385
Substrate
Meas. Tech.
β-Glucuronidase Activity Assay
IC50
320±n/a nM
Citation
 Williams, ALScott, JYeh, LRedinbo, MR Phenoxy thiophene sulfonamides and their use as inhibitors of glucuronidase US Patent  US9617239 Publication Date 4/11/2017 
Target
Name:
Beta-glucuronidase
Synonyms:
β-Glucuronidase Beta-G1 GUSB | beta-Glucuronidase (β-glucuronidase)
Type:
Protein
Mol. Mass.:
74736.05
Organism:
Homo sapiens (Human)
Description:
Residue:
651
  
Inhibitor
Name:
BDBM316385
Synonyms:
US9617239, BRITE-355016
Type:
Small organic molecule
Emp. Form.:
C21H28N4O4S2
Mol. Mass.:
464.601
SMILES:
O=C1CCCN1CCCNS(=O)(=O)c1ccc(Oc2cccc(c2)N2CCNCC2)s1
: