Target
Beta-glucuronidase
Ligand
BDBM316460
Substrate
Meas. Tech.
β-Glucuronidase Activity Assay
IC50
100.0±n/a nM
Citation
 Williams, ALScott, JYeh, LRedinbo, MR Phenoxy thiophene sulfonamides and their use as inhibitors of glucuronidase US Patent  US9617239 Publication Date 4/11/2017 
Target
Name:
Beta-glucuronidase
Synonyms:
β-Glucuronidase Beta-G1 GUSB | beta-Glucuronidase (β-glucuronidase)
Type:
Protein
Mol. Mass.:
74736.05
Organism:
Homo sapiens (Human)
Description:
Residue:
651
  
Inhibitor
Name:
BDBM316460
Synonyms:
US9617239, BRITE-492803
Type:
Small organic molecule
Emp. Form.:
C22H24ClN3O4S2
Mol. Mass.:
494.027
SMILES:
COc1ccc(CNS(=O)(=O)c2cc(Cl)c(Oc3cccc(c3)N3CCNCC3)s2)cc1
: