Target
Beta-glucuronidase
Ligand
BDBM316468
Substrate
Meas. Tech.
β-Glucuronidase Activity Assay
IC50
40.0±n/a nM
Citation
 Williams, ALScott, JYeh, LRedinbo, MR Phenoxy thiophene sulfonamides and their use as inhibitors of glucuronidase US Patent  US9617239 Publication Date 4/11/2017 
Target
Name:
Beta-glucuronidase
Synonyms:
β-Glucuronidase Beta-G1 GUSB | beta-Glucuronidase (β-glucuronidase)
Type:
Protein
Mol. Mass.:
74736.05
Organism:
Homo sapiens (Human)
Description:
Residue:
651
  
Inhibitor
Name:
BDBM316468
Synonyms:
US9617239, BRITE-492809
Type:
Small organic molecule
Emp. Form.:
C21H21ClFN3O3S2
Mol. Mass.:
481.991
SMILES:
Fc1cccc(CNS(=O)(=O)c2cc(Cl)c(Oc3cccc(c3)N3CCNCC3)s2)c1
: