Target
Orexin receptor type 2
Ligand
BDBM316470
Substrate
Meas. Tech.
FLIPR Ca2+ Flux Assay
IC50
82.9±n/a nM
Citation
 Kuduk, SDSkudlarek, JW Thioether-piperidinyl orexin receptor antagonists US Patent  US9617246 Publication Date 4/11/2017 
Target
Name:
Orexin receptor type 2
Synonyms:
HCRTR2 OX2R_HUMAN Orexin receptor type 2 (OR-2) Orexin receptor type 2 (OX2R) Ox-2-R | Ox2-R
Type:
Protein
Mol. Mass.:
50710.53
Organism:
Homo sapiens (Human)
Description:
O43614
Residue:
444
  
Inhibitor
Name:
BDBM316470
Synonyms:
2-methyl-6-{[(3R,6R)-6-methyl- 1-{[2-(2H-1,2,3-triazol-2- yl)phenyl]carbonyl}piperidin-3- yl]sulfanyl}pyridine-4-carbonitrile | US9617246, 2
Type:
Small organic molecule
Emp. Form.:
C22H22N6OS
Mol. Mass.:
418.515
SMILES:
C[C@@H]1CC[C@H](CN1C(=O)c1ccccc1-n1nccn1)Sc1cc(cc(C)n1)C#N
: