Target
Orexin/Hypocretin receptor type 1
Ligand
BDBM316490
Substrate
IC50
489±n/a nM
Citation
 Kuduk, SDSkudlarek, JW Thioether-piperidinyl orexin receptor antagonists US Patent  US9617246 Publication Date 4/11/2017 
Target
Name:
Orexin/Hypocretin receptor type 1
Synonyms:
HCRTR1 OX1R_HUMAN Orexin receptor type 1 (OR 1) Orexin receptor type 1 (OX1) Orexin receptor type 1 (OxR1) | Ox1r
Type:
Protein
Mol. Mass.:
47554.50
Organism:
Homo sapiens (Human)
Description:
O43613
Residue:
425
  
Inhibitor
Name:
BDBM316490
Synonyms:
2-{[(3R,6R)-1-{[5-bromo-2-(2H-1,2,3- triazol-2-yl)phenyl]carbonyl}-6- methylpiperidin-3-yl]sulfanyl}pyridine-4- carbonitrile | US9617246, 24
Type:
Small organic molecule
Emp. Form.:
C21H19BrN6OS
Mol. Mass.:
483.384
SMILES:
C[C@@H]1CC[C@H](CN1C(=O)c1cc(Br)ccc1-n1nccn1)Sc1cc(ccn1)C#N
: