Target
Orexin/Hypocretin receptor type 1
Ligand
BDBM316497
Substrate
IC50
3190±n/a nM
Citation
 Kuduk, SDSkudlarek, JW Thioether-piperidinyl orexin receptor antagonists US Patent  US9617246 Publication Date 4/11/2017 
Target
Name:
Orexin/Hypocretin receptor type 1
Synonyms:
HCRTR1 OX1R_HUMAN Orexin receptor type 1 (OR 1) Orexin receptor type 1 (OX1) Orexin receptor type 1 (OxR1) | Ox1r
Type:
Protein
Mol. Mass.:
47554.50
Organism:
Homo sapiens (Human)
Description:
O43613
Residue:
425
  
Inhibitor
Name:
BDBM316497
Synonyms:
2-{[(3R,6R)-6-methyl-1-{[2-(1-methyl- 1H-pyrazol-4- yl)phenyl]carbonyl}piperidin-3- yl]sulfanyl}pyridine-4-carbonitrile | US9617246, 31
Type:
Small organic molecule
Emp. Form.:
C23H23N5OS
Mol. Mass.:
417.527
SMILES:
C[C@@H]1CC[C@H](CN1C(=O)c1ccccc1-c1cnn(C)c1)Sc1cc(ccn1)C#N
: