Target
Orexin receptor type 2
Ligand
BDBM316499
Substrate
Meas. Tech.
FLIPR Ca2+ Flux Assay
IC50
29.4±n/a nM
Citation
 Kuduk, SDSkudlarek, JW Thioether-piperidinyl orexin receptor antagonists US Patent  US9617246 Publication Date 4/11/2017 
Target
Name:
Orexin receptor type 2
Synonyms:
HCRTR2 OX2R_HUMAN Orexin receptor type 2 (OR-2) Orexin receptor type 2 (OX2R) Ox-2-R | Ox2-R
Type:
Protein
Mol. Mass.:
50710.53
Organism:
Homo sapiens (Human)
Description:
O43614
Residue:
444
  
Inhibitor
Name:
BDBM316499
Synonyms:
2-{[(3R,6R)-6-methyl-1-{[2-(1- methylethoxy)phenyl]carbonyl} piperidin- 3-yl]sulfanyl}pyridine-4-carbonitrile | US9617246, 33
Type:
Small organic molecule
Emp. Form.:
C22H25N3O2S
Mol. Mass.:
395.518
SMILES:
CC(C)Oc1ccccc1C(=O)N1C[C@@H](CC[C@H]1C)Sc1cc(ccn1)C#N
: