Target
Sphingosine 1-phosphate receptor 1
Ligand
BDBM317454
Substrate
Meas. Tech.
GTPγS Binding Assay
EC50
0.2±n/a nM
Citation
 Bolli, MLescop, CNayler, OSteiner, B Pyridin-4-yl derivatives US Patent  US9617250 Publication Date 4/11/2017 
Target
Name:
Sphingosine 1-phosphate receptor 1
Synonyms:
CHEDG1 Endothelial differentiation G-protein coupled receptor 1 S1P1 S1PR1_HUMAN Sphingosine 1-phosphate receptor Edg-1
Type:
Enzyme
Mol. Mass.:
42836.02
Organism:
Homo sapiens (Human)
Description:
P21453
Residue:
382
  
Inhibitor
Name:
BDBM317454
Synonyms:
US9617250, Example 233 of D1
Type:
Emp. Form.:
C27H34N4O5
Mol. Mass.:
494.5827
SMILES:
CCc1cc(cc(C)c1OC[C@@H](O)CNC(=O)CO)-c1noc(n1)-c1cc(C)nc(c1)C1CCCC1
: