Target
Tyrosine-protein kinase JAK3
Ligand
BDBM316538
Substrate
Meas. Tech.
JAK Caliper Enzyme Assay
IC50
153±n/a nM
Citation
 Thorarensen, ABrown, MFCasimiro-Garcia, AChe, YCoe, JWFlanagan, MEGilbert, AMHayward, MMLangille, JDMontgomery, JITelliez, JUnwalla, RJTrujillo, JI Pyrrolo[2,3-d]pyrimidinyl, pyrrolo[2,3-b]pyrazinyl and pyrrolo[2,3-d]pyridinyl acrylamides US Patent  US9617258 Publication Date 4/11/2017 
Target
Name:
Tyrosine-protein kinase JAK3
Synonyms:
JAK-3 JAK3_HUMAN Janus kinase 3 (JAK3) L-JAK | Leukocyte janus kinase
Type:
Protein
Mol. Mass.:
125111.08
Organism:
Homo sapiens (Human)
Description:
P52333
Residue:
1124
  
Inhibitor
Name:
BDBM316538
Synonyms:
1-[(3R)-3-{[5-(pyridin-3-yl)-7H-pyrrolo[2,3-d]pyrimidin-4-yl]amino}piperidin-1-yl]prop-2-en-1-one US9617258, Example 26
Type:
Small organic molecule
Emp. Form.:
C19H20N6O
Mol. Mass.:
348.4017
SMILES:
C=CC(=O)N1CCC[C@H](C1)Nc1ncnc2[nH]cc(-c3cccnc3)c12
: