Target
Tyrosine-protein kinase JAK3
Ligand
BDBM316650
Substrate
Meas. Tech.
JAK Caliper Enzyme Assay
IC50
144±n/a nM
Citation
 Thorarensen, ABrown, MFCasimiro-Garcia, AChe, YCoe, JWFlanagan, MEGilbert, AMHayward, MMLangille, JDMontgomery, JITelliez, JUnwalla, RJTrujillo, JI Pyrrolo[2,3-d]pyrimidinyl, pyrrolo[2,3-b]pyrazinyl and pyrrolo[2,3-d]pyridinyl acrylamides US Patent  US9617258 Publication Date 4/11/2017 
Target
Name:
Tyrosine-protein kinase JAK3
Synonyms:
JAK-3 JAK3_HUMAN Janus kinase 3 (JAK3) L-JAK | Leukocyte janus kinase
Type:
Protein
Mol. Mass.:
125111.08
Organism:
Homo sapiens (Human)
Description:
P52333
Residue:
1124
  
Inhibitor
Name:
BDBM316650
Synonyms:
4-{[(3R)-1-acryloylpiperidin-3-yl]amino}-N-(2-hydroxyethyl)-7H-pyrrolo[2,3-d]pyrimidine-5-carboxamide US9617258, Example 143
Type:
Small organic molecule
Emp. Form.:
C17H22N6O3
Mol. Mass.:
358.395
SMILES:
OCCNC(=O)c1c[nH]c2ncnc(N[C@@H]3CCCN(C3)C(=O)C=C)c12
: