Target
Tyrosine-protein kinase JAK3
Ligand
BDBM316655
Substrate
Meas. Tech.
JAK Caliper Enzyme Assay
IC50
6957±n/a nM
Citation
 Thorarensen, ABrown, MFCasimiro-Garcia, AChe, YCoe, JWFlanagan, MEGilbert, AMHayward, MMLangille, JDMontgomery, JITelliez, JUnwalla, RJTrujillo, JI Pyrrolo[2,3-d]pyrimidinyl, pyrrolo[2,3-b]pyrazinyl and pyrrolo[2,3-d]pyridinyl acrylamides US Patent  US9617258 Publication Date 4/11/2017 
Target
Name:
Tyrosine-protein kinase JAK3
Synonyms:
JAK-3 JAK3_HUMAN Janus kinase 3 (JAK3) L-JAK | Leukocyte janus kinase
Type:
Protein
Mol. Mass.:
125111.08
Organism:
Homo sapiens (Human)
Description:
P52333
Residue:
1124
  
Inhibitor
Name:
BDBM316655
Synonyms:
4-({(3R)-1-[(2E)-but-2-enoyl]piperidin-3-yl}amino)-N-(2-hydroxyethyl)-7H-pyrrolo[2,3-d]pyrimidine-5-carboxamide US9617258, Example 148
Type:
Small organic molecule
Emp. Form.:
C18H24N6O3
Mol. Mass.:
372.4216
SMILES:
C\C=C\C(=O)N1CCC[C@H](C1)Nc1ncnc2[nH]cc(C(=O)NCCO)c12
: