Target
Casein kinase I isoform alpha
Ligand
BDBM7533
Substrate
Casein
Meas. Tech.
Kinase Inhibition Assay
Temperature
303.15±n/a K
IC50
17000±n/a nM
Comments
extracted
Citation
 Gompel, MLeost, MDe Kier Joffe, EBPuricelli, LFranco, LHPalermo, JMeijer, L Meridianins, a new family of protein kinase inhibitors isolated from the ascidian Aplidium meridianum. Bioorg Med Chem Lett 14:1703-7 (2004)  
Target
Name:
Casein kinase I isoform alpha
Synonyms:
CK1 Casein Kinase I KC1A_RAT
Type:
Enzyme
Mol. Mass.:
37514.97
Organism:
Rattus norvegicus (rat)
Description:
Residue:
325
  
Inhibitor
Name:
BDBM7533
Synonyms:
(2R)-2-[[6-(benzylamino)-9-isopropyl-purin-2-yl]amino]butan-1-ol (2R)-2-[[6-[(phenylmethyl)amino]-9-propan-2-yl-2-purinyl]amino]-1-butanol (2R)-2-{[6-(benzylamino)-9-(propan-2-yl)-9H-purin-2-yl]amino}butan-1-ol 2,6,9-Trisubstituted purine deriv. 28 CYC-202 cid_160355
Type:
Small organic molecule
Emp. Form.:
C19H26N6O
Mol. Mass.:
354.4493
SMILES:
CC[C@H](CO)Nc1nc(NCc2ccccc2)c2ncn(C(C)C)c2n1
:
Substrate
Name:
Casein
Synonyms:
Type:
Other Protein Type
Mol. Mass.:
20807.68
Organism:
Homo sapiens (Human)
Description:
Residue:
177