Target
Histone deacetylase 4
Ligand
BDBM293899
Substrate
Meas. Tech.
Inhibition Assay
IC50
10.00±n/a nM
Citation
 Dominguez, CMuñoz-Sanjuán, IMaillard, MLuckhurst, CAJarvis, REBürli, RWAllen, DRHaughan, AFBreccia, PVater, HDStott, AJPenrose, SDWall, MSaville-Stones, EAWishart, GHughes, SJ Histone deacetylase inhibitors and compositions and methods of use thereof US Patent  US9617259 Publication Date 4/11/2017 
Target
Name:
Histone deacetylase 4
Synonyms:
Cereblon/Histone deacetylase 4 HDAC4 Histone acetylase 4(HDAC4) KIAA0288
Type:
Enzyme
Mol. Mass.:
119049.39
Organism:
Homo sapiens (Human)
Description:
P56524
Residue:
1084
  
Inhibitor
Name:
BDBM293899
Synonyms:
(S)-1-(3-Fluoro-2- methylphenyl)-N- hydroxy-3-(6- methylpyridin-3- yl)cyclopent-2- enecarboxamide US9617259, 25
Type:
Small organic molecule
Emp. Form.:
C19H19FN2O2
Mol. Mass.:
326.3648
SMILES:
Cc1ccc(cn1)C1=C[C@](CC1)(C(=O)NO)c1cccc(F)c1C
: