Target
Histone deacetylase 4
Ligand
BDBM293903
Substrate
Meas. Tech.
Inhibition Assay
IC50
30.0±n/a nM
Citation
 Dominguez, CMuñoz-Sanjuán, IMaillard, MLuckhurst, CAJarvis, REBürli, RWAllen, DRHaughan, AFBreccia, PVater, HDStott, AJPenrose, SDWall, MSaville-Stones, EAWishart, GHughes, SJ Histone deacetylase inhibitors and compositions and methods of use thereof US Patent  US9617259 Publication Date 4/11/2017 
Target
Name:
Histone deacetylase 4
Synonyms:
Cereblon/Histone deacetylase 4 HDAC4 Histone acetylase 4(HDAC4) KIAA0288
Type:
Enzyme
Mol. Mass.:
119049.39
Organism:
Homo sapiens (Human)
Description:
P56524
Residue:
1084
  
Inhibitor
Name:
BDBM293903
Synonyms:
(S)-3-(Benzo[d]isothiazol- 7-yl)-1-(3-fluoro-2- methylphenyl)-N- hydroxycyclopent-2- enecarboxamide US9617259, 29
Type:
Small organic molecule
Emp. Form.:
C20H17FN2O2S
Mol. Mass.:
368.425
SMILES:
Cc1c(F)cccc1[C@@]1(CCC(=C1)c1cccc2cnsc12)C(=O)NO
: