Target
Tyrosine-protein kinase BTK
Ligand
BDBM316844
Substrate
Meas. Tech.
TR-FRET (Time Resolved FRET) Assay
IC50
13.0±n/a nM
Citation
 Chin, EWeikert, RJYun, WZhang, J Inhibitors of bruton's tyrosine kinase US Patent  US9617260 Publication Date 4/11/2017 
Target
Name:
Tyrosine-protein kinase BTK
Synonyms:
AGMX1 Agammaglobulinaemia tyrosine kinase B cell progenitor kinase BPK BTK_HUMAN Tyrosine Kinase BTK Tyrosine-protein kinase BTK (BTK)
Type:
Enzyme
Mol. Mass.:
76289.95
Organism:
Homo sapiens (Human)
Description:
Q06187
Residue:
659
  
Inhibitor
Name:
BDBM316844
Synonyms:
US9617260, Compound 5 | propan-2-yl N- [3-[3-[[(E)-4- (dimethyl- amino)but-2- enoyl]amino] phenyl]-1H- pyrrolo[2,3- b]pyridin-5- yl]carbamate
Type:
Small organic molecule
Emp. Form.:
C23H27N5O3
Mol. Mass.:
421.4922
SMILES:
CC(C)OC(=O)Nc1cnc2[nH]cc(-c3cccc(NC(=O)\C=C\CN(C)C)c3)c2c1
: