Target
Fatty acid synthase
Ligand
BDBM182941
Substrate
Meas. Tech.
Biochemical Assay of FASN
pH
7±n/a
Temperature
298.15±n/a K
IC50
<300±n/a nM
Comments
extracted
Citation
 Tsaklakidis, CStaehle, WLeuthner, BCzodrowski, PFuchss, T 1,3-diaminocyclopentane carboxamide derivatives US Patent  US9670142 Publication Date 6/6/2017 
Target
Name:
Fatty acid synthase
Synonyms:
FAS FAS_HUMAN HU FASN
Type:
Enzyme
Mol. Mass.:
273419.37
Organism:
Homo sapiens (Human)
Description:
P49327
Residue:
2511
  
Inhibitor
Name:
BDBM182941
Synonyms:
US9670142, A3 4-benzoxazol-2-yl-N-methyl-N-{(1R,3S)-3-[(1-methyl-cyclopropanecarbonyl)-amino]-cyclopentyl}-benzamide
Type:
Small organic molecule
Emp. Form.:
C25H27N3O3
Mol. Mass.:
417.5002
SMILES:
CN([C@@H]1CC[C@@H](C1)NC(=O)C1(C)CC1)C(=O)c1ccc(cc1)-c1nc2ccccc2o1
: