Target
Fatty acid synthase
Ligand
BDBM183004
Substrate
Meas. Tech.
Biochemical Assay of FASN
pH
7±n/a
Temperature
298.15±n/a K
IC50
<300±n/a nM
Comments
extracted
Citation
 Tsaklakidis, CStaehle, WLeuthner, BCzodrowski, PFuchss, T 1,3-diaminocyclopentane carboxamide derivatives US Patent  US9670142 Publication Date 6/6/2017 
Target
Name:
Fatty acid synthase
Synonyms:
FAS FAS_HUMAN HU FASN
Type:
Enzyme
Mol. Mass.:
273419.37
Organism:
Homo sapiens (Human)
Description:
P49327
Residue:
2511
  
Inhibitor
Name:
BDBM183004
Synonyms:
US9670142, A33 4-benzoxazol-2-yl-N-[(1R,3S)-3-((S)-2-methoxy-propionylamino)-cyclopentyl]-N-methyl-benzamide
Type:
Small organic molecule
Emp. Form.:
C24H27N3O4
Mol. Mass.:
421.4889
SMILES:
CO[C@@H](C)C(=O)N[C@H]1CC[C@H](C1)N(C)C(=O)c1ccc(cc1)-c1nc2ccccc2o1
: