Target
Fatty acid synthase
Ligand
BDBM185537
Substrate
Meas. Tech.
Biochemical Assay of FASN
pH
7±n/a
Temperature
298.15±n/a K
IC50
<300±n/a nM
Comments
extracted
Citation
 Tsaklakidis, CStaehle, WLeuthner, BCzodrowski, PFuchss, T 1,3-diaminocyclopentane carboxamide derivatives US Patent  US9670142 Publication Date 6/6/2017 
Target
Name:
Fatty acid synthase
Synonyms:
FAS FAS_HUMAN HU FASN
Type:
Enzyme
Mol. Mass.:
273419.37
Organism:
Homo sapiens (Human)
Description:
P49327
Residue:
2511
  
Inhibitor
Name:
BDBM185537
Synonyms:
US9670142, A125 5-(1-methyl-1H-indol-5-yl)-pyrazine-2-carboxylic acid methyl-((1R,3S)-3-propionylamino-cyclopentyl)-amide
Type:
Small organic molecule
Emp. Form.:
C23H27N5O2
Mol. Mass.:
405.4928
SMILES:
CCC(=O)N[C@H]1CC[C@H](C1)N(C)C(=O)c1cnc(cn1)-c1ccc2n(C)ccc2c1
: