Target
Dual specificity mitogen-activated protein kinase kinase 1
Ligand
BDBM316877
Substrate
Meas. Tech.
LANCE Ultra Assay
IC50
<1000±n/a nM
Citation
 Lee, GJeon, HSJeon, KJRhim, CYKim, JSSeo, JCho, SYKim, CSLee, JSChoi, EKHwang, JJKim, B Substituted pyridinone compounds as MEK inhibitors US Patent  US9617261 Publication Date 4/11/2017 
Target
Name:
Dual specificity mitogen-activated protein kinase kinase 1
Synonyms:
Dual specificity mitogen-activated protein kinase (MEK) Dual specificity mitogen-activated protein kinase kinase 1 (MEK1) Dual specificity mitogen-activated protein kinase kinase MEK1/2 MAP kinase kinase 1 MAPK/ERK kinase 1 MEK-1 MP2K1_HUMAN PRKMK1 | VHL-MAP2K1/MAP2K2
Type:
Other Protein Type
Mol. Mass.:
43439.03
Organism:
Homo sapiens (Human)
Description:
Full-length human MEK-1 was generated by PCR and purified as a fusion protein from Escherichia coli lysates.
Residue:
393
  
Inhibitor
Name:
BDBM316877
Synonyms:
US9617261, Example 00078
Type:
Small organic molecule
Emp. Form.:
C18H16FIN4O4
Mol. Mass.:
498.2469
SMILES:
Cn1c(Nc2ccc(I)cc2F)c(C(=O)NOCCO)c2ncccc2c1=O
: