Target
Enoyl-[acyl-carrier-protein] reductase [NADPH] FabI
Ligand
BDBM316926
Substrate
Meas. Tech.
Enzyme Inhibition Assay
IC50
2680±n/a nM
Citation
 Guillemont, JELancois, DFMotte, MMKoul, ABalemans, WMArnoult, EP Antibacterial cyclopental[C]pyrrole substituted 3,4-dihydro-1H-[1,8]naphthyridinones US Patent  US9617262 Publication Date 4/11/2017 
Target
Name:
Enoyl-[acyl-carrier-protein] reductase [NADPH] FabI
Synonyms:
Enoyl-[acyl-carrier-protein] reductase [NADPH] FabI FABI_STAA8 fabI
Type:
Enzyme
Mol. Mass.:
28019.03
Organism:
Staphylococcus aureus
Description:
Q2FZQ3
Residue:
256
  
Inhibitor
Name:
BDBM316926
Synonyms:
US9617262, Compound 42
Type:
Small organic molecule
Emp. Form.:
C18H19N3O2
Mol. Mass.:
309.3624
SMILES:
O=C(\C=C\c1cnc2NC(=O)CCc2c1)N1CC2CC=CC2C1
: