Target
RAF proto-oncogene serine/threonine-protein kinase
Ligand
BDBM316951
Substrate
Meas. Tech.
Biochemical Assay
IC50
<100.0±n/a nM
Citation
 Ibrahim, PNSpevak, WCho, HShi, SZhang, CZhang, Y Compounds and methods for kinase modulation, and indications therefor US Patent  US9617267 Publication Date 4/11/2017 
Target
Name:
RAF proto-oncogene serine/threonine-protein kinase
Synonyms:
C-Raf Protein Kinase RAF RAF1 Raf-1 Serine/threonine-protein kinase C-Raf | cRaf
Type:
Serine/threonine-protein kinase
Mol. Mass.:
73082.52
Organism:
Homo sapiens (Human)
Description:
P04049
Residue:
648
  
Inhibitor
Name:
BDBM316951
Synonyms:
Propane-1-sulfonic acid [3- (4-ethoxy-7H-pyrrolo[2,3-d] pyrimidine-5-carbonyl)- 2,4-difluoro-phenyl]-amide | US9617267, Compound P-1002
Type:
Small organic molecule
Emp. Form.:
C18H18F2N4O4S
Mol. Mass.:
424.422
SMILES:
CCCS(=O)(=O)Nc1ccc(F)c(C(=O)c2c[nH]c3ncnc(COC)c23)c1F
: