Target
Serine/threonine-protein kinase B-raf
Ligand
BDBM316964
Substrate
Meas. Tech.
Biochemical Assay
IC50
>100.0±n/a nM
Citation
 Ibrahim, PNSpevak, WCho, HShi, SZhang, CZhang, Y Compounds and methods for kinase modulation, and indications therefor US Patent  US9617267 Publication Date 4/11/2017 
Target
Name:
Serine/threonine-protein kinase B-raf
Synonyms:
B-RAF B-Raf proto-oncogene serine/threonine-protein kinase BRAF1 RAFB1 v-Raf murine sarcoma viral oncogene homolog B1
Type:
Serine/threonine-protein kinase
Mol. Mass.:
84446.00
Organism:
Homo sapiens (Human)
Description:
P15056
Residue:
766
  
Inhibitor
Name:
BDBM316964
Synonyms:
N-[2,4-Difluoro-3-(4- isobutyl-7H-pyrrolo[2,3- d]pyrimidine-5-carbonyl)- phenyl]-4-trifluoromethyl- benzenesulfonamide | US9617267, Compound P-1015
Type:
Small organic molecule
Emp. Form.:
C24H19F5N4O3S
Mol. Mass.:
538.49
SMILES:
CC(C)Cc1ncnc2[nH]cc(C(=O)c3c(F)ccc(NS(=O)(=O)c4ccc(cc4)C(F)(F)F)c3F)c12
: