Target
Serine/threonine-protein kinase B-raf
Ligand
BDBM316982
Substrate
Meas. Tech.
Biochemical Assay
IC50
>100.0±n/a nM
Citation
 Ibrahim, PNSpevak, WCho, HShi, SZhang, CZhang, Y Compounds and methods for kinase modulation, and indications therefor US Patent  US9617267 Publication Date 4/11/2017 
Target
Name:
Serine/threonine-protein kinase B-raf
Synonyms:
B-RAF B-Raf proto-oncogene serine/threonine-protein kinase BRAF1 RAFB1 v-Raf murine sarcoma viral oncogene homolog B1
Type:
Serine/threonine-protein kinase
Mol. Mass.:
84446.00
Organism:
Homo sapiens (Human)
Description:
P15056
Residue:
766
  
Inhibitor
Name:
BDBM316982
Synonyms:
Propane-1-sulfonic acid [3- (4-chloro-7H-pyrrolo[2,3- d]pyrimidine-5-carbonyl)- 2,4-difluoro-phenyl]-amide | US9617267, Compound P-1033
Type:
Small organic molecule
Emp. Form.:
C16H13ClF2N4O3S
Mol. Mass.:
414.814
SMILES:
CCCS(=O)(=O)Nc1ccc(F)c(C(=O)c2c[nH]c3ncnc(Cl)c23)c1F
: