Target
Serine/threonine-protein kinase B-raf
Ligand
BDBM316994
Substrate
Meas. Tech.
Biochemical Assay
IC50
>100.0±n/a nM
Citation
 Ibrahim, PNSpevak, WCho, HShi, SZhang, CZhang, Y Compounds and methods for kinase modulation, and indications therefor US Patent  US9617267 Publication Date 4/11/2017 
Target
Name:
Serine/threonine-protein kinase B-raf
Synonyms:
B-RAF B-Raf proto-oncogene serine/threonine-protein kinase BRAF1 RAFB1 v-Raf murine sarcoma viral oncogene homolog B1
Type:
Serine/threonine-protein kinase
Mol. Mass.:
84446.00
Organism:
Homo sapiens (Human)
Description:
P15056
Residue:
766
  
Inhibitor
Name:
BDBM316994
Synonyms:
N-[2,4-Difluoro-3-(4- isopropylamino-7H- pyrrolo[2,3-d]pyrimidine-5- carbonyl)-phenyl]-3,5- dimethyl-benzenesulfonamide | US9617267, Compound P-1045
Type:
Small organic molecule
Emp. Form.:
C24H23F2N5O3S
Mol. Mass.:
499.533
SMILES:
CC(C)Nc1ncnc2[nH]cc(C(=O)c3c(F)ccc(NS(=O)(=O)c4cc(C)cc(C)c4)c3F)c12
: