Target
Serine/threonine-protein kinase B-raf
Ligand
BDBM317013
Substrate
Meas. Tech.
Biochemical Assay
IC50
<100.0±n/a nM
Citation
 Ibrahim, PNSpevak, WCho, HShi, SZhang, CZhang, Y Compounds and methods for kinase modulation, and indications therefor US Patent  US9617267 Publication Date 4/11/2017 
Target
Name:
Serine/threonine-protein kinase B-raf
Synonyms:
B-RAF B-Raf proto-oncogene serine/threonine-protein kinase BRAF1 RAFB1 v-Raf murine sarcoma viral oncogene homolog B1
Type:
Serine/threonine-protein kinase
Mol. Mass.:
84446.00
Organism:
Homo sapiens (Human)
Description:
P15056
Residue:
766
  
Inhibitor
Name:
BDBM317013
Synonyms:
US9617267, Compound P-2001 US9617267, Compound P-2003 US9617267, Compound P-2005 US9617267, Compound P-2007 US9617267, Compound P-2012 US9617267, Compound P-2015
Type:
Small organic molecule
Emp. Form.:
C10H11F2NO3S
Mol. Mass.:
263.261
SMILES:
CCCS(=O)(=O)Nc1ccc(F)c(C=O)c1F
: