Target
Serine/threonine-protein kinase B-raf
Ligand
BDBM317021
Substrate
Meas. Tech.
Biochemical Assay
IC50
>100.0±n/a nM
Citation
 Ibrahim, PNSpevak, WCho, HShi, SZhang, CZhang, Y Compounds and methods for kinase modulation, and indications therefor US Patent  US9617267 Publication Date 4/11/2017 
Target
Name:
Serine/threonine-protein kinase B-raf
Synonyms:
B-RAF B-Raf proto-oncogene serine/threonine-protein kinase BRAF1 RAFB1 v-Raf murine sarcoma viral oncogene homolog B1
Type:
Serine/threonine-protein kinase
Mol. Mass.:
84446.00
Organism:
Homo sapiens (Human)
Description:
P15056
Residue:
766
  
Inhibitor
Name:
BDBM317021
Synonyms:
US9617267, Compound P-2009 US9617267, Compound P-2011 US9617267, Compound P-2016
Type:
Small organic molecule
Emp. Form.:
C14H8F5NO3S
Mol. Mass.:
365.275
SMILES:
Fc1ccc(NS(=O)(=O)c2ccc(cc2)C(F)(F)F)c(F)c1C=O
: