Target
Cytochrome P450 2D6
Ligand
BDBM316952
Substrate
Meas. Tech.
Inhibition Assay
IC50
>10000±n/a nM
Citation
 Ibrahim, PNSpevak, WCho, HShi, SZhang, CZhang, Y Compounds and methods for kinase modulation, and indications therefor US Patent  US9617267 Publication Date 4/11/2017 
Target
Name:
Cytochrome P450 2D6
Synonyms:
CP2D6_HUMAN CYP2DL1 Cytochrome P450 2D6 (CYP2D6) P450-DB1
Type:
Protein
Mol. Mass.:
55774.82
Organism:
Homo sapiens (Human)
Description:
P10635
Residue:
497
  
Inhibitor
Name:
BDBM316952
Synonyms:
2-Methyl-propane-1-sulfonic acid [2,4-difluoro-3-(4- methyl-7H-pyrrolo[2,3- d]pyrimidine-5-carbonyl)- phenyl]-amide | US9617267, Compound P-1003
Type:
Small organic molecule
Emp. Form.:
C18H18F2N4O3S
Mol. Mass.:
408.422
SMILES:
CC(C)CS(=O)(=O)Nc1ccc(F)c(C(=O)c2c[nH]c3ncnc(C)c23)c1F
: