Target
Cytochrome P450 3A4
Ligand
BDBM316953
Substrate
Meas. Tech.
Inhibition Assay
IC50
>10000±n/a nM
Citation
 Ibrahim, PNSpevak, WCho, HShi, SZhang, CZhang, Y Compounds and methods for kinase modulation, and indications therefor US Patent  US9617267 Publication Date 4/11/2017 
Target
Name:
Cytochrome P450 3A4
Synonyms:
Albendazole monooxygenase CP3A4_HUMAN CYP3A4 CYPIIIA4 Cytochrome P450 3A4 (CYP3A4) Nifedipine oxidase Taurochenodeoxycholate 6-alpha-hydroxylase
Type:
Enzyme
Mol. Mass.:
57349.57
Organism:
Homo sapiens (Human)
Description:
Residue:
503
  
Inhibitor
Name:
BDBM316953
Synonyms:
2-Methyl-propane-1-sulfonic acid [2,4-difluoro-3-(4- methoxy-7H-pyrrolo[2,3- d]pyrimidine-5-carbonyl)- phenyl]-amide | US9617267, Compound P-1004
Type:
Small organic molecule
Emp. Form.:
C18H18F2N4O4S
Mol. Mass.:
424.422
SMILES:
COc1ncnc2[nH]cc(C(=O)c3c(F)ccc(NS(=O)(=O)CC(C)C)c3F)c12
: