Target
Cytochrome P450 3A4
Ligand
BDBM316959
Substrate
Meas. Tech.
Inhibition Assay
IC50
>10000±n/a nM
Citation
 Ibrahim, PNSpevak, WCho, HShi, SZhang, CZhang, Y Compounds and methods for kinase modulation, and indications therefor US Patent  US9617267 Publication Date 4/11/2017 
Target
Name:
Cytochrome P450 3A4
Synonyms:
Albendazole monooxygenase CP3A4_HUMAN CYP3A4 CYPIIIA4 Cytochrome P450 3A4 (CYP3A4) Nifedipine oxidase Taurochenodeoxycholate 6-alpha-hydroxylase
Type:
Enzyme
Mol. Mass.:
57349.57
Organism:
Homo sapiens (Human)
Description:
Residue:
503
  
Inhibitor
Name:
BDBM316959
Synonyms:
N-[2,4-Difluoro-3-(4- methoxy-7H-pyrrolo[2,3- d]pyrimidine-5-carbonyl)- phenyl]-4-isopropyl- benzenesulfonamide | US9617267, Compound P-1010
Type:
Small organic molecule
Emp. Form.:
C23H20F2N4O4S
Mol. Mass.:
486.491
SMILES:
COc1ncnc2[nH]cc(C(=O)c3c(F)ccc(NS(=O)(=O)c4ccc(cc4)C(C)C)c3F)c12
: