Target
Cytochrome P450 1A2
Ligand
BDBM316990
Substrate
Meas. Tech.
Inhibition Assay
IC50
>10000±n/a nM
Citation
 Ibrahim, PNSpevak, WCho, HShi, SZhang, CZhang, Y Compounds and methods for kinase modulation, and indications therefor US Patent  US9617267 Publication Date 4/11/2017 
Target
Name:
Cytochrome P450 1A2
Synonyms:
CP1A2_HUMAN CYPIA2 Cytochrome P(3)450 Cytochrome P450 1A2 (CYP1A2) Cytochrome P450-P3
Type:
Enzyme
Mol. Mass.:
58423.38
Organism:
Homo sapiens (Human)
Description:
P05177
Residue:
516
  
Inhibitor
Name:
BDBM316990
Synonyms:
Propane-1-sulfonic acid [3- (4-cyclopropylamino-7H- pyrrolo[2,3-d]pyrimidine-5- carbonyl)-2,4-difluoro- phenyl]-amide | US9617267, Compound P-1041
Type:
Small organic molecule
Emp. Form.:
C19H19F2N5O3S
Mol. Mass.:
435.448
SMILES:
CCCS(=O)(=O)Nc1ccc(F)c(C(=O)c2c[nH]c3ncnc(NC4CC4)c23)c1F
: