Target
Cytochrome P450 2D6
Ligand
BDBM317006
Substrate
Meas. Tech.
Inhibition Assay
IC50
>10000±n/a nM
Citation
 Ibrahim, PNSpevak, WCho, HShi, SZhang, CZhang, Y Compounds and methods for kinase modulation, and indications therefor US Patent  US9617267 Publication Date 4/11/2017 
Target
Name:
Cytochrome P450 2D6
Synonyms:
CP2D6_HUMAN CYP2DL1 Cytochrome P450 2D6 (CYP2D6) P450-DB1
Type:
Protein
Mol. Mass.:
55774.82
Organism:
Homo sapiens (Human)
Description:
P10635
Residue:
497
  
Inhibitor
Name:
BDBM317006
Synonyms:
N-{2,4-Difluoro-3-[4-(1- methyl-piperidin-4-ylamino)- 7H-pyrrolo[2,3-d]pyrimidine- 5-carbonyl]-phenyl}-4- trifluoromethyl- benzenesulfonamide | US9617267, Compound P-1057
Type:
Small organic molecule
Emp. Form.:
C26H23F5N6O3S
Mol. Mass.:
594.556
SMILES:
CN1CCC(CC1)Nc1ncnc2[nH]cc(C(=O)c3c(F)ccc(NS(=O)(=O)c4ccc(cc4)C(F)(F)F)c3F)c12
: