Target
Cytochrome P450 2C9
Ligand
BDBM317040
Substrate
Meas. Tech.
Inhibition Assay
IC50
>10000±n/a nM
Citation
 Ibrahim, PNSpevak, WCho, HShi, SZhang, CZhang, Y Compounds and methods for kinase modulation, and indications therefor US Patent  US9617267 Publication Date 4/11/2017 
Target
Name:
Cytochrome P450 2C9
Synonyms:
(R)-limonene 6-monooxygenase CP2C9_HUMAN CYP2C9 Cytochrome P450 2C9 (CYP2C9 ) P-450MP P450 PB-1 | S-mephenytoin 4-hydroxylase
Type:
Enzyme
Mol. Mass.:
55636.33
Organism:
Homo sapiens (Human)
Description:
P11712
Residue:
490
  
Inhibitor
Name:
BDBM317040
Synonyms:
N-[3-(4-Cyclopropylamino- 7H-pyrrolo[2,3-d]pyrimidine- 5-carbonyl)-2,4-difluoro- phenyl]-2,5-difluoro- benzenesulfonamide | US9617267, Compound P-1104
Type:
Small organic molecule
Emp. Form.:
C22H15F4N5O3S
Mol. Mass.:
505.445
SMILES:
Fc1ccc(F)c(c1)S(=O)(=O)Nc1ccc(F)c(C(=O)c2c[nH]c3ncnc(NC4CC4)c23)c1F
: