Target
High affinity cGMP-specific 3',5'-cyclic phosphodiesterase 9A
Ligand
BDBM317077
Substrate
Meas. Tech.
Inhibition Assay
IC50
20.0±n/a nM
Citation
 Luo, HWan, YKe, HLiu, PHuang, MShao, YZhu, XCai, YLiu, Y N-substituted pyrazolo [3,4-D] pyrimidine ketone compound, and preparation process and use thereof US Patent  US9617269 Publication Date 4/11/2017 
Target
Name:
High affinity cGMP-specific 3',5'-cyclic phosphodiesterase 9A
Synonyms:
3',5'-cyclic phosphodiesterase PDE9A_HUMAN Phosphodiesterase 9A (PDE9) | Phosphodiesterase 9A (PDE9A)
Type:
Protein
Mol. Mass.:
68488.40
Organism:
Homo sapiens (Human)
Description:
O76083
Residue:
593
  
Inhibitor
Name:
BDBM317077
Synonyms:
US9617269, Compound WYQ-28
Type:
Small organic molecule
Emp. Form.:
C18H21N5O2
Mol. Mass.:
339.3916
SMILES:
COc1ccc(CNc2nc3n(ncc3c(=O)[nH]2)C2CCCC2)cc1
: