Target
High affinity cGMP-specific 3',5'-cyclic phosphodiesterase 9A
Ligand
BDBM317134
Substrate
Meas. Tech.
Inhibition Assay
IC50
121±n/a nM
Citation
 Luo, HWan, YKe, HLiu, PHuang, MShao, YZhu, XCai, YLiu, Y N-substituted pyrazolo [3,4-D] pyrimidine ketone compound, and preparation process and use thereof US Patent  US9617269 Publication Date 4/11/2017 
Target
Name:
High affinity cGMP-specific 3',5'-cyclic phosphodiesterase 9A
Synonyms:
3',5'-cyclic phosphodiesterase PDE9A_HUMAN Phosphodiesterase 9A (PDE9) | Phosphodiesterase 9A (PDE9A)
Type:
Protein
Mol. Mass.:
68488.40
Organism:
Homo sapiens (Human)
Description:
O76083
Residue:
593
  
Inhibitor
Name:
BDBM317134
Synonyms:
US9617269, Compound WYQ-85
Type:
Small organic molecule
Emp. Form.:
C17H18F3N5O
Mol. Mass.:
365.3529
SMILES:
CC(C)Cn1ncc2c1nc(NCc1ccc(cc1)C(F)(F)F)[nH]c2=O
: