Target
cAMP and cAMP-inhibited cGMP 3',5'-cyclic phosphodiesterase 10A
Ligand
BDBM317146
Substrate
Meas. Tech.
Inhibition Assay
IC50
4.00±n/a nM
Citation
 Flohr, AGroebke Zbinden, KLerner, C Triazolo compounds US Patent  US9617271 Publication Date 4/11/2017 
Target
Name:
cAMP and cAMP-inhibited cGMP 3',5'-cyclic phosphodiesterase 10A
Synonyms:
3',5'-cyclic phosphodiesterase PDE10_HUMAN Phosphodiesterase 10A
Type:
Protein
Mol. Mass.:
88412.52
Organism:
Homo sapiens (Human)
Description:
Q9Y233
Residue:
779
  
Inhibitor
Name:
BDBM317146
Synonyms:
3-Methyl-6-((1-methyl-5-(pyrrolidin-1-yl)-1H-1,2,4-triazol-3-yl)ethynyl)-2-(trifluoromethyl)imidazo[1,2-b]pyridazine US9617271, 4
Type:
Small organic molecule
Emp. Form.:
C17H16F3N7
Mol. Mass.:
375.351
SMILES:
Cc1c(nc2ccc(nn12)C#Cc1nc(N2CCCC2)n(C)n1)C(F)(F)F
: