Target
cAMP and cAMP-inhibited cGMP 3',5'-cyclic phosphodiesterase 10A
Ligand
BDBM317169
Substrate
Meas. Tech.
Inhibition Assay
IC50
3.00±n/a nM
Citation
 Flohr, AGroebke Zbinden, KLerner, C Triazolo compounds US Patent  US9617271 Publication Date 4/11/2017 
Target
Name:
cAMP and cAMP-inhibited cGMP 3',5'-cyclic phosphodiesterase 10A
Synonyms:
3',5'-cyclic phosphodiesterase PDE10_HUMAN Phosphodiesterase 10A
Type:
Protein
Mol. Mass.:
88412.52
Organism:
Homo sapiens (Human)
Description:
Q9Y233
Residue:
779
  
Inhibitor
Name:
BDBM317169
Synonyms:
8-Isopropoxy-2,3-dimethyl-6-(2-(1-methyl-3-(pyrrolidin-1-yl)-1H-1,2,4-triazol-5-yl)ethyl)imidazo[1,2-b]pyridazine | US9617271, 27
Type:
Small organic molecule
Emp. Form.:
C20H29N7O
Mol. Mass.:
383.4906
SMILES:
CC(C)Oc1cc(CCc2nc(nn2C)N2CCCC2)nn2c(C)c(C)nc12
: