Target
cAMP and cAMP-inhibited cGMP 3',5'-cyclic phosphodiesterase 10A
Ligand
BDBM317171
Substrate
Meas. Tech.
Inhibition Assay
IC50
5.00±n/a nM
Citation
 Flohr, AGroebke Zbinden, KLerner, C Triazolo compounds US Patent  US9617271 Publication Date 4/11/2017 
Target
Name:
cAMP and cAMP-inhibited cGMP 3',5'-cyclic phosphodiesterase 10A
Synonyms:
3',5'-cyclic phosphodiesterase PDE10A Phosphodiesterase 10 (PDE10) | Phosphodiesterase 10A
Type:
Protein
Mol. Mass.:
88412.52
Organism:
Homo sapiens (Human)
Description:
Q9Y233
Residue:
1055
  
Inhibitor
Name:
BDBM317171
Synonyms:
2,3-Dimethyl-6-((1-methyl-3-(pyrrolidin-1-yl)-1H-1,2,4-triazol-5-yl)ethynyl)-8-(methylsulfonyl)imidazo[1,2-b]pyridazine | US9617271, 29
Type:
Small organic molecule
Emp. Form.:
C18H21N7O2S
Mol. Mass.:
399.47
SMILES:
Cc1nc2c(cc(nn2c1C)C#Cc1nc(nn1C)N1CCCC1)S(C)(=O)=O
: