Target
cAMP and cAMP-inhibited cGMP 3',5'-cyclic phosphodiesterase 10A
Ligand
BDBM317213
Substrate
Meas. Tech.
Inhibition Assay
IC50
8.70±n/a nM
Citation
 Flohr, AGroebke Zbinden, KLerner, C Triazolo compounds US Patent  US9617271 Publication Date 4/11/2017 
Target
Name:
cAMP and cAMP-inhibited cGMP 3',5'-cyclic phosphodiesterase 10A
Synonyms:
3',5'-cyclic phosphodiesterase PDE10_HUMAN Phosphodiesterase 10A
Type:
Protein
Mol. Mass.:
88412.52
Organism:
Homo sapiens (Human)
Description:
Q9Y233
Residue:
779
  
Inhibitor
Name:
BDBM317213
Synonyms:
3-Methyl-5-[2-(2-methyl-5-pyrrolidin-1-yl-1,2,4-triazol-3-yl)ethynyl]-2-(trifluoromethyl)pyrazolo[1,5-a]pyrimidine | US9617271, 71
Type:
Small organic molecule
Emp. Form.:
C17H16F3N7
Mol. Mass.:
375.351
SMILES:
Cc1c(nn2ccc(nc12)C#Cc1nc(nn1C)N1CCCC1)C(F)(F)F
: